صافش خلأء
type: Concept
broader: صافش
preferred label: vacuum filtration @en
scope note: فرایندی برای آبگیری لجن که در آن صافش ازطریق پارچۀ صافی و در خلأ انجام می‌شود.

صافش
type: Concept
narrower: صافش خلأء
preferred label: filtration @en