شناوکسازی با هوا
type: Concept
broader: شناوکسازی
preferred label: dissolved air flotation @en
scope note: نوعی روش جداسازی که در آن ازطریق هوادهی، حباب‌های هوا به مواد معلق فاضلاب می‌چسبند و آنها را در سطح شناور می‌سازند.

شناوکسازی
type: Concept
narrower: شناوکسازی با هوا
preferred label: flotation @en