هم‌برجذبش
type: Concept
broader: برجذبش
preferred label: coadsorption @en
scope note: برجذبش بیش از یک ماده به‌صورت هم‌زمان بر روی یک سطح

برجذبش
type: Concept
narrower: هم‌برجذبش
preferred label: adsorption @en