برجذب دماتناوبی
type: Concept
broader: برجذبش
preferred label: temperature swing adsorption @en
scope note: روشی که در آن یک مادۀ جاذب، تحت دماهای متناوب، گازها را براساس برجذب و واجذبش چرخه‌ای جدا می‌کند.

برجذبش
type: Concept
narrower: برجذب دماتناوبی
preferred label: adsorption @en