واکنش افزایشی
type: Concept
broader: واکنش شیمیایی
preferred label: addition reaction @en
scope note: واکنش هیدروکربن‌های سیرنشده با هیدروژن و هالوژن‌ها و هیدروژن‌هالیدها و واکنشگرهای دیگر، به‌طوری‌که ترکیب پیچیده‌تری تشکیل شود.

واکنش شیمیایی
type: Concept
narrower: واکنش افزایشی
preferred label: chemical reaction @en