رطوبت‌پزی
type: Concept
broader: پخت
preferred label: moisture curing @en
scope note: پخته شدن پوشش براثر قرار گرفتن در معرض رطوبت محیط

پخت
type: Concept
narrower: رطوبت‌پزی
preferred label: curing @en