نیترات‌زدایی بی‌اکسل
type: Concept
broader: نیترات‌زدایی
preferred label: anoxic denitrification @en
scope note: فرایندی که در آن نیتروژن نیترات در غیاب اکسیژن به روش زیستی به گاز نیتروژن تبدیل می‌شود.

نیترات‌زدایی
type: Concept
narrower: نیترات‌زدایی بی‌اکسل
preferred label: denitrification @en