پیش‌کلرزنی
type: Concept
broader: کلرزنی
preferred label: prechlorination @en
scope note: افزودن کلر به آب یا فاضلاب، قبل از سایر فرایندهای تصفیه

کلرزنی
type: Concept
narrower: پیش‌کلرزنی
preferred label: chlorination @en