خودهمپارش
type: Concept
alternative label: همپارش جای‌گشتی
broader: همپارش
preferred label: automerization @en
scope note: نوعی بازآرایی مولکولی که در آن محصول اصلی بدون نشانه‌گذاری ایزوتوپی از واکنش‌دهندۀ اصلی قابل تشخیص نیست.

همپارش
type: Concept
narrower: خودهمپارش
preferred label: isomerization @en