هم‌بسپارش پیوندی
type: Concept
broader: هم‌بسپارش
preferred label: graft copolymerization @en
related: بازده پیوندزنی
scope note: هم‌بسپارشی که در آن یک یا چند زنجیرة بسپاری به یک زنجیرة بسپاری اصلی متصل می‌شود.

هم‌بسپارش
type: Concept
narrower: هم‌بسپارش پیوندی
preferred label: copolymerization @en

بازده پیوندزنی
type: Concept
preferred label: grafting efficiency @en
related: هم‌بسپارش پیوندی