بسپارش ریشالی
type: Concept
broader: بسپارش
preferred label: micellar polymerization @en
scope note: بسپارش در محلولی از یک عاسف که شامل گروه ‌بسپارش‌پذیر در بالای غلظت بحرانی ریشال است.

بسپارش
type: Concept
narrower: بسپارش ریشالی
preferred label: polymerization @en