بسپارش پفکی
type: Concept
broader: بسپارش
preferred label: popcorn polymerization @en
scope note: جدا شدن ذرات بسپار کوچک و غیرشفاف در ‌هنگام بسپارش رادیکالی

بسپارش
type: Concept
narrower: بسپارش پفکی
preferred label: polymerization @en