بسپارش تعلیقی
type: Concept
broader: بسپارش
preferred label: suspension polymerization @en
scope note: بسپارشی که در آن تکپارها به‌وسیلۀ همزن مکانیکی در فاز مایع پراکنده می‌شوند.

بسپارش
type: Concept
narrower: بسپارش تعلیقی
preferred label: polymerization @en