ترکیبات آلی
type: Concept
preferred label: organic compounds @en
related: سنتز یک‌کاسه

سنتز یک‌کاسه
type: Concept
broader: سنتز (شیمیایی)
preferred label: one-pot synthesis @en
related: ترکیبات آلی
scope note: نوعی سنتز ترکیبات آلی که در آن مواد را در یک ظرف مخلوط می‌کنند و به‌ جای آنکه واکنش در مراحل متعدد انجام شود، به‌طور یکجا انجام می‌شود.

سنتز (شیمیایی)
type: Concept
narrower: سنتز یک‌کاسه
preferred label: synthesis (chemical) @en