سوانگاری لایه‌نازک شعاعی
type: Concept
broader: سوانگاری لایه‌نازک
preferred label: radial thin-layer chromatography @en
scope note: نوعی سوانگاری لایه‌نازک که در آن نمونه در مرکز یک صفحۀ گرد قرار می‌گیرد و حلاّل متحرک از مرکز شروع به خیس کردن صفحه می‌کند.

سوانگاری لایه‌نازک
type: Concept
narrower: سوانگاری لایه‌نازک شعاعی
preferred label: thin layer chromatography @en