تمیزکاری پاششی مرکز‌گریز
type: Concept
broader: تمیزکاری پاششی
preferred label: centrifugal blast cleaning @en
scope note: نوعی تمیزکاری سطح فلز که در آن از یک چرخ پره‌دار پرسرعت برای پاشش ذرات ساینده با نیروی مرکزگریزی استفاده می‌کنند.

تمیزکاری پاششی
type: Concept
narrower: تمیزکاری پاششی مرکز‌گریز
preferred label: blast cleaning @en