شناوه جهات اصلی
type: Concept
alternative label: بویه جهات اصلی
broader: شناوه
preferred label: cardinal buoy @en
scope note: شناوه‌ای که چهار جهت اصلی جغرافیایی در نقطۀ مبدأ را نشان می‌دهد.

شناوه
type: Concept
narrower: شناوه جهات اصلی
preferred label: buoy @en