شناوه نشان‌گذار
type: Concept
broader: شناوه
preferred label: dan buoy @en
scope note: شناوه‌ای که از آن در عملیات مین‌روبی برای مشخص کردن مسیر یا منطقۀ مین‌روبیشده استفاده میشود.

شناوه
type: Concept
narrower: شناوه نشان‌گذار
preferred label: buoy @en