شناوه روگاه
type: Concept
alternative label: بویه روگاه
broader: شناوه
preferred label: fairway buoy @en
scope note: شناوه‌/ بویه‌ای که روگاه را در آبراه مشخص می‌کند.

شناوه
type: Concept
narrower: شناوه روگاه
preferred label: buoy @en