شبکه تلویزیون بافه‌ای درختی
type: Concept
alternative label: شبکه تلویزیون کابلی درختی
broader: سامانه تلویزیون بافه‌ای
preferred label: tree and branch cable TV network @en
scope note: نوعی پیکربندی در سامانه‌های توزیع شبکۀ بافه/ کابل هم‌محور در تلویزیون بافه‌ای/ کابلی که در آن یک بافۀ هم‌محور، همانند تنۀ یک درخت، حامل همتافتی از شبکه‌های تلویزیونی است و از آن بافه‌هایی مانند شاخه‌هایی منشعب می‌شود و نشانک/ سیگنال را به خانه‌ها می‌رساند.

سامانه تلویزیون بافه‌ای
type: Concept
narrower: شبکه تلویزیون بافه‌ای درختی
preferred label: cable television system @en