رادیوراه
type: Concept
broader: رادیو
preferred label: highway advisory radio @en
scope note: نوعی شبکۀ رادیویی که ازطریق آن شرایط تردد در بزرگراه‌ها هم‌زمان با پخش برنامۀ عادی رادیو به رانندگان اعلام می‌شود.

رادیو
type: Concept
narrower: رادیوراه
preferred label: radio @en