رادیوی سیار طیف‌مشترک
type: Concept
broader: رادیو
preferred label: trunked mobile radio @en
scope note: سامانه‌ای در ارتباطات رادیویی سیار شخصی برای صرفه‌جویی در طیف که در آن چند کاربر رادیو در مجموعه‌ای از خطوط رادیویی با کاربران دیگر شریک می‌شوند.

رادیو
type: Concept
narrower: رادیوی سیار طیف‌مشترک
preferred label: radio @en