تلویزیون پولی
type: Concept
broader: تلویزیون
preferred label: pay television @en
scope note: نوعی خدمات تلویزیونی که تماشای برنامه‌های آن مستلزم پرداخت وجه ماهیانه است.

تلویزیون
type: Concept
narrower: تلویزیون پولی
preferred label: television @en