دیواره انتهایی بارگنج
type: Concept
broader: اجزای بارگنج
preferred label: container end wall @en
scope note: هریک از دو دیواره‌ای که در چارچوب‌های انتهایی بارگُنج محاط است.

اجزای بارگنج
type: Concept
narrower: دیواره انتهایی بارگنج
preferred label: container components @en