پیچ دوسررزوه اسبک
type: Concept
broader: پیچ دوسر (بست)
preferred label: rocker arm stud @en
scope note: پیچ دوسررزوه‌ای که برای بستن محور اسبک‌ها بر روی سرسیلندر به کار می‌رود.

پیچ دوسر (بست)
type: Concept
narrower: پیچ دوسررزوه اسبک
preferred label: stud (fastener) @en