عدسی ناستیگمات‌ساز
type: Concept
broader: عدسی
preferred label: anastigmatic lens @en
scope note: عدسی مرکبی که آستیگماتی را کمینه می‌کند و اَبیراهی‌های رنگی و کروی را در سامانۀ اپتیکی کاهش می‌‌دهد.

عدسی
type: Concept
narrower: عدسی ناستیگمات‌ساز
preferred label: lens @en