عدسی مستقیم‌ساز
type: Concept
broader: عدسی
preferred label: erecting lens @en
scope note: سامانه‌ای از عدسی‌ها، معمولاً در تلسکوپ‌های کپلری، که متشکل از چهار عدسی است و تصویر نهایی حاصل از آنها مستقیم است.

عدسی
type: Concept
narrower: عدسی مستقیم‌ساز
preferred label: lens @en