عدسی چارقطبی الکتریکی
type: Concept
broader: عدسی چارقطبی
preferred label: electric quadrupole lens @en

عدسی چارقطبی
type: Concept
broader: عدسی
narrower: عدسی چارقطبی الکتریکی
preferred label: quadrupole lens @en
scope note: وسیله‌ای که در آن برای کانونی کردن باریکه‌های ذرات باردار از میدان چارقطبی الکتریکی یا مغناطیسی استفاده می‌شود.

عدسی
type: Concept
narrower: عدسی چارقطبی
preferred label: lens @en