یاتاقان میل‌بادامک
type: Concept
broader: یاتاقان (قسمت‌های ماشین)
preferred label: camshaft bearing @en
scope note: یاتاقان لغزشی که میل‌بادامک را در محل خود نگه می‌دارد.

یاتاقان (قسمت‌های ماشین)
type: Concept
narrower: یاتاقان میل‌بادامک
preferred label: bearing (machine parts) @en