میل‌لنگ متوازن
type: Concept
broader: میل‌لنگ
preferred label: balanced crankshaft @en
scope note: میل‌لنگی که دارای چند وزنۀ تعادل برای کاهش ارتعاش ناشی از حرکت پیستون‌ها است.

میل‌لنگ
type: Concept
narrower: میل‌لنگ متوازن
preferred label: crankshaft @en