میراگر میل‌لنگ
type: Concept
broader: میل‌لنگ
preferred label: crankshaft balancer @en
scope note: افزاره‌ای در سر پیشین میل‌لنگ که برای کاهش لرزش‌های ناشی از حرکت رفت‌وبرگشت پیستون طراحی شده است.

میل‌لنگ
type: Concept
narrower: میراگر میل‌لنگ
preferred label: crankshaft @en