تاج پیستون
type: Concept
broader: پیستون
preferred label: piston crown @en
scope note: بخشی از پیستون که در بالای رینگ تراکم قرار دارد.

پیستون
type: Concept
narrower: تاج پیستون
preferred label: piston @en