انگشتی آزاد پیستون
type: Concept
broader: انگشتی پیستون
preferred label: floating piston pin @en
scope note: انگشتی پیستونی که به دسته‌پیستون یا پیستون قفل نشده است و می‌تواند هم در سوی پیستون و هم در سوی دسته‌پیستون نوسان یا چرخش داشته باشد.

انگشتی پیستون
type: Concept
narrower: انگشتی آزاد پیستون
preferred label: piston pin @en