بدنه پیستون
type: Concept
broader: پیستون
preferred label: piston skirt @en
scope note: بخشی از سطح خارجی پیستون که در پایین رینگ‌ها قرار دارد.

پیستون
type: Concept
narrower: بدنه پیستون
preferred label: piston @en