واشر سرسیلندر
type: Concept
broader: واشر (درزگیر)
preferred label: cylinder head gasket @en
scope note: واشری، مقاوم در برابر گرما و فشار بسیار بالا، بین سرسیلندر و بدنۀ سیلندر که مانع از ورود سیال خنک‌کننده به محفظۀ احتراق می‌شود.

واشر (درزگیر)
type: Concept
narrower: واشر سرسیلندر
preferred label: gasket @en