فنر هوایی
type: Concept
broader: فنر وسیله نقلیه
preferred label: air spring @en
scope note: فنری دارای یک پایه و محفظه‌ای کشسان که با هوای کم‌فشار پر شده است و در سامانۀ تعلیق قطارهای شهری و بین‌شهری به کار می‌رود.

فنر وسیله نقلیه
type: Concept
narrower: فنر هوایی
preferred label: vehicle spring @en