تیر گیردارـ ساده
type: Concept
broader: تیر
preferred label: fixed-free beam @en
scope note: تیری که یک سر آن کاملاً گیردار و سر دیگر آن بر روی تکیه‌گاه ساده قرار گیرد.

تیر
type: Concept
narrower: تیر گیردارـ ساده
preferred label: beam @en