تیر منشوری
type: Concept
alternative label: تیر مقطع‌ثابت
broader: تیر
preferred label: prismatic beam @en
scope note: تیری منشوری‌شکل که مقطع آن در طول ثابت باشد.

تیر
type: Concept
narrower: تیر منشوری
preferred label: beam @en