تیر ساده
type: Concept
broader: تیر
preferred label: simple supported beam @en
scope note: تیری که روی دو تکیه‌گاه ساده قرار گیرد و خَمش و برش را تحمل کند.

تیر
type: Concept
narrower: تیر ساده
preferred label: beam @en