تیر محیطی
type: Concept
broader: تیر
preferred label: spandrel beam @en
scope note: تیر بیرونی در یک سازۀ فولادی یا بتنی که بین دو طبقه قرار گیرد.

تیر
type: Concept
narrower: تیر محیطی
preferred label: beam @en