جوش لبه‌ای
type: Concept
broader: جوش
preferred label: edge weld @en
scope note: نوعی جوش در اتصال لبه‌ای یا اتصال لب‌به‌لب یا اتصال گوشه‌ای لبه‌دار که در آن کل ضخامت قطعۀ کار ذوب می‌شود.

جوش
type: Concept
narrower: جوش لبه‌ای
preferred label: weld @en