جوش انگشتانه
type: Concept
broader: جوش
preferred label: plug weld @en
scope note: جوشی در سوراخ دایره‌شکل یک قطعه که با ذوب دیوارۀ سوراخ و نیز ذوب قطعۀ دیگر باعث اتصال دو قطعه می‌شود.

جوش
type: Concept
narrower: جوش انگشتانه
preferred label: weld @en