جوش درز
type: Concept
broader: جوش
preferred label: seam weld @en
scope note: جوش پیوسته‌ای که بین دو قطعۀ روی هم و در یک سطح،‌ از یک یا چند دکمۀ جوش، به‌وسیلۀ گرمایش مقاومتی و اعمال فشار ایجاد می‌شود.

جوش
type: Concept
narrower: جوش درز
preferred label: weld @en