جوش کام
type: Concept
broader: جوش
preferred label: slot weld @en
scope note: جوشی در سوراخ طویل‌شکل یک قطعه که با ذوب دیوارۀ سوراخ و نیز ذوب قطعۀ دیگر باعث اتصال دو قطعه می‌شود.

جوش
type: Concept
narrower: جوش کام
preferred label: weld @en