تجزیۀ برخط
type: Concept
broader: تجزیه و تحلیل
preferred label: online analysis @en
scope note: سامانۀ تجزیۀ خودکاری که در آن با استفاده از کاوند از منبع نمونه می‌گیرند و سپس نمونه را وارد بخش تجزیه می‌کنند.

تجزیه و تحلیل
type: Concept
narrower: تجزیۀ برخط
preferred label: analysis @en