مخروط سکوت
type: Concept
broader: مخروط
preferred label: cone of silence @en
related: آنتن
scope note: منطقۀ مخروطی‌شکل فضای بالای آنتن‌ها که در آن نشانک‌ها/ سیگنال‌های رادیویی ارسال‌شده ضعیف می‌شوند یا شنیده نمی‌شوند.

مخروط
type: Concept
narrower: مخروط سکوت
preferred label: cone @en

آنتن
type: Concept
preferred label: antenna @en
related: مخروط سکوت