صورت‌بندی قایقی
type: Concept
broader: صورت‌بندی
preferred label: boat conformation @en
scope note: شکل فضایی قایق‌مانندی که سیکلوهگزان یا ترکیب‌های مشابه به خود می‌گیرند.

صورت‌بندی
type: Concept
narrower: صورت‌بندی قایقی
preferred label: conformation @en