ثابت سرعت دفع
type: Concept
broader: ثابت
preferred label: elimination rate constant @en
related: دارودرمانی
scope note: شاخص سرعت دفع دارو از بدن نسبت به کل داروی واردشده

ثابت
type: Concept
narrower: ثابت سرعت دفع
preferred label: constant @en

دارودرمانی
type: Concept
preferred label: drug therapy @en
related: ثابت سرعت دفع