پویانمایی
type: Concept
alternative label: انیمیشن
preferred label: animation @en
related: تصویر متحرک
related: نگاشتار رایانه‌ای
scope note: شیوۀ فیلم‌سازی که در آن به تصاویر معمولاً نقاشی‌شده و اجسام بی‌حرکت تحرک بخشیده شود.

نگاشتار رایانه‌ای
type: Concept
preferred label: computer graphics @en
related: پویانمایی

تصویر متحرک
type: Concept
preferred label: motion picture @en
related: پویانمایی