خدمات ابری رایانش
type: Concept
alternative label: خارا
broader: رایانش ابری
preferred label: computing as a service @en
scope note: شاخه‌ای نو در رایانش اَبری که به شرکت‌ها امکان می‌دهد از منطق رایانش و پردازش در داخل خود شرکت استفاده کنند بی‌آنکه به نسخه‌های نرم‌افزاری دارای امتیاز بهره‌برداری و دستگاه‌های پردازش و سخت‌افزار رایانش نیاز داشته باشند.

رایانش ابری
type: Concept
narrower: خدمات ابری رایانش
preferred label: cloud computing @en